BDBM50007074 4-(2-nitrovinyl)phenyl 4-(butylcarbamoyl)benzenesulfonate::4-Butylcarbamoyl-benzenesulfonic acid 4-(2-nitro-vinyl)-phenyl ester::CHEMBL77100
SMILES CCCCNC(=O)c1ccc(cc1)[S+]([O-])(=O)Oc1ccc(\C=C\[N+]([O-])=O)cc1
InChI Key InChIKey=NQVYWFJDBFJBCY-WYMLVPIESA-N
Data  4 IC50
  Tab Delimited (TSV)   2D SDfile   Computed 3D by Vconf -m prep SDfile
Find this compound or compounds like it in BindingDB:
Activity Spreadsheet -- Enzyme Inhibition Constant Data from BindingDB
Found 4 hits for monomerid = 50007074
TargetTyrosine-protein kinase transforming protein Abl(Abelson murine leukemia virus)
TBA
Curated by ChEMBL
LigandPNGBDBM50007074(4-(2-nitrovinyl)phenyl 4-(butylcarbamoyl)benzenesu...)
Affinity DataIC50: >1.00E+5nM. Assay description: Inhibition of Abelson murine leukemia virus p60 v-abl
In DepthDetails ArticlePubMed
TargetTyrosine-protein kinase ABL1/ABL2(Homo sapiens (Human))
Ciba-Geigy
Curated by ChEMBL
LigandPNGBDBM50007074(4-(2-nitrovinyl)phenyl 4-(butylcarbamoyl)benzenesu...)
Affinity DataIC50: >1.00E+5nM. Assay description: Inhibition of recombinant v-Abl tyrosine kinase.
In DepthDetails ArticlePubMed
TargetEpidermal growth factor receptor(Homo sapiens (Human))
Ciba-Geigy
Curated by ChEMBL
LigandPNGBDBM50007074(4-(2-nitrovinyl)phenyl 4-(butylcarbamoyl)benzenesu...)
Affinity DataIC50:  4.80E+3nM. Assay description: Inhibition of the epidermal growth factor receptor expressed in A431 cell line
In DepthDetails ArticlePubMed
TargetEpidermal growth factor receptor(Homo sapiens (Human))
Ciba-Geigy
Curated by ChEMBL
LigandPNGBDBM50007074(4-(2-nitrovinyl)phenyl 4-(butylcarbamoyl)benzenesu...)
Affinity DataIC50:  5.00E+3nM. Assay description: Inhibition of EGFR in human A431 cells
In DepthDetails ArticlePubMed