BDBM50007098 6,11-Dimethyl-3-(tetrahydro-furan-2-ylmethyl)-1,2,3,4,5,6-hexahydro-2,6-methano-benzo[d]azocin-8-ol::CHEMBL2367760::MR-1526
SMILES [H][C@]12Cc3ccc(O)cc3[C@@](C)(CCN1C[C@H]1CCC(=O)O1)[C@H]2C
InChI Key InChIKey=HHASRPPPJAXSNL-IQRRUJBNSA-N
Data  1 IC50
  Tab Delimited (TSV)   2D SDfile   Computed 3D by Vconf -m prep SDfile
Find this compound or compounds like it in BindingDB:
Activity Spreadsheet -- Enzyme Inhibition Constant Data from BindingDB
Found 1 hit for monomerid = 50007098
TargetKappa-type opioid receptor(Cavia porcellus (domestic guinea pig))
University Of Washington
Curated by ChEMBL
LigandPNGBDBM50007098(6,11-Dimethyl-3-(tetrahydro-furan-2-ylmethyl)-1,2,...)
Affinity DataIC50:  400nM. Assay description: Displacement of [3H]-bremazocine from opioid receptor kappa of guinea pig membrane.
In DepthDetails ArticlePubMed