BDBM50007109 4-Amino-3-(3-chloro-phenyl)-butyric acid::CHEMBL315789
SMILES NCC(CC(O)=O)c1cccc(Cl)c1
InChI Key InChIKey=MPBCYSRMIUBLQM-UHFFFAOYSA-N
Data  1 IC50
  Tab Delimited (TSV)   2D SDfile   Computed 3D by Vconf -m prep SDfile
Find this compound or compounds like it in BindingDB:
Activity Spreadsheet -- Enzyme Inhibition Constant Data from BindingDB
Found 1 hit for monomerid = 50007109
TargetGamma-aminobutyric acid type B receptor subunit 1/2(Rattus norvegicus (Rat))
Laboratoire De Pharmacie Chimique, Facult�
Curated by ChEMBL
LigandPNGBDBM50007109(4-Amino-3-(3-chloro-phenyl)-butyric acid | CHEMBL3...)
Affinity DataIC50:  2.00E+4nM. Assay description: Inhibition of [3H]baclofen binding to rat gamma-aminobutyric acid type B receptor.
In DepthDetails ArticlePubMed