BDBM50007110 4-Amino-3-(4-bromo-thiophen-2-yl)-butyric acid::CHEMBL315950
SMILES NCC(CC(O)=O)c1cc(Br)cs1
InChI Key InChIKey=VQHITWOESIJQLI-UHFFFAOYSA-N
Data  1 IC50
  Tab Delimited (TSV)   2D SDfile   Computed 3D by Vconf -m prep SDfile
Find this compound or compounds like it in BindingDB:
Activity Spreadsheet -- Enzyme Inhibition Constant Data from BindingDB
Found 1 hit for monomerid = 50007110
TargetGamma-aminobutyric acid type B receptor subunit 1/2(Rattus norvegicus (Rat))
Laboratoire De Pharmacie Chimique, Facult�
Curated by ChEMBL
LigandPNGBDBM50007110(4-Amino-3-(4-bromo-thiophen-2-yl)-butyric acid | C...)
Affinity DataIC50:  3.91E+4nM. Assay description: Inhibition of [3H]baclofen binding to rat gamma-aminobutyric acid type B receptor.
In DepthDetails ArticlePubMed