BDBM50007112 4-Amino-3-(5-methyl-furan-2-yl)-butyric acid::CHEMBL83011
SMILES Cc1ccc(o1)C(CN)CC(O)=O
InChI Key InChIKey=PGYJNLYVCJDULF-UHFFFAOYSA-N
Data  1 IC50
  Tab Delimited (TSV)   2D SDfile   Computed 3D by Vconf -m prep SDfile
Find this compound or compounds like it in BindingDB:
Activity Spreadsheet -- Enzyme Inhibition Constant Data from BindingDB
Found 1 hit for monomerid = 50007112
TargetGamma-aminobutyric acid type B receptor subunit 1/2(Rattus norvegicus (Rat))
Laboratoire De Pharmacie Chimique, Facult�
Curated by ChEMBL
LigandPNGBDBM50007112(4-Amino-3-(5-methyl-furan-2-yl)-butyric acid | CHE...)
Affinity DataIC50: >1.00E+5nM. Assay description: Inhibition of [3H]baclofen binding to rat gamma-aminobutyric acid type B receptor.
In DepthDetails ArticlePubMed