BDBM50007117 4-Amino-3-thiophen-2-yl-butyric acid::CHEMBL315476
SMILES NCC(CC(O)=O)c1cccs1
InChI Key InChIKey=QDVRXIPQICAUFK-UHFFFAOYSA-N
Data  1 IC50
  Tab Delimited (TSV)   2D SDfile   Computed 3D by Vconf -m prep SDfile
Find this compound or compounds like it in BindingDB:
Activity Spreadsheet -- Enzyme Inhibition Constant Data from BindingDB
Found 1 hit for monomerid = 50007117
TargetGamma-aminobutyric acid type B receptor subunit 1/2(Rattus norvegicus (Rat))
Laboratoire De Pharmacie Chimique, Facult�
Curated by ChEMBL
LigandPNGBDBM50007117(4-Amino-3-thiophen-2-yl-butyric acid | CHEMBL31547...)
Affinity DataIC50:  9.72E+3nM. Assay description: Inhibition of [3H]baclofen binding to rat gamma-aminobutyric acid type B receptor.
In DepthDetails ArticlePubMed