BDBM50007121 4-Amino-3-(2-chloro-phenyl)-butyric acid::CHEMBL83245
SMILES NCC(CC(O)=O)c1ccccc1Cl
InChI Key InChIKey=RNSIJRUPQJHCBR-UHFFFAOYSA-N
Data  1 IC50
  Tab Delimited (TSV)   2D SDfile   Computed 3D by Vconf -m prep SDfile
Find this compound or compounds like it in BindingDB:
Activity Spreadsheet -- Enzyme Inhibition Constant Data from BindingDB
Found 1 hit for monomerid = 50007121
TargetGamma-aminobutyric acid type B receptor subunit 1/2(Rattus norvegicus (Rat))
Laboratoire De Pharmacie Chimique, Facult�
Curated by ChEMBL
LigandPNGBDBM50007121(4-Amino-3-(2-chloro-phenyl)-butyric acid | CHEMBL8...)
Affinity DataIC50:  800nM. Assay description: Inhibition of [3H]baclofen binding to rat gamma-aminobutyric acid type B receptor.
In DepthDetails ArticlePubMed