BDBM50007163 2-(3,4-Dichloro-phenyl)-1-(1-pyrrolidin-1-ylmethyl-1,3,4,5-tetrahydro-pyrido[4,3-b]indol-2-yl)-ethanone;0.5H2O::CHEMBL330449
SMILES Clc1ccc(CC(=O)N2CCc3[nH]c4ccccc4c3C2CN2CCCC2)cc1Cl
InChI Key InChIKey=SRBDHMOWSKFOIL-UHFFFAOYSA-N
Data  3 KI
  Tab Delimited (TSV)   2D SDfile   Computed 3D by Vconf -m prep SDfile
Find this compound or compounds like it in BindingDB:
Activity Spreadsheet -- Enzyme Inhibition Constant Data from BindingDB
Found 3 hits for monomerid = 50007163
TargetKappa-type opioid receptor(Cavia porcellus (domestic guinea pig))
Zambeletti Research Laboratories
Curated by ChEMBL
LigandPNGBDBM50007163(2-(3,4-Dichloro-phenyl)-1-(1-pyrrolidin-1-ylmethyl...)
Affinity DataKi:  100nM. Assay description: Displacement of [3H]-BRL 52537 from opioid receptor kappa site in guinea pig
In DepthDetails ArticlePubMed
TargetDelta-type opioid receptor(Homo sapiens (Human))
Zambeletti Research Laboratories
Curated by ChEMBL
LigandPNGBDBM50007163(2-(3,4-Dichloro-phenyl)-1-(1-pyrrolidin-1-ylmethyl...)
Affinity DataKi: >1.00E+3nM. Assay description: Affinity for opioid receptor delta sites
In DepthDetails ArticlePubMed
TargetMu-type opioid receptor(GUINEA PIG)
Zambeletti Research Laboratories
Curated by ChEMBL
LigandPNGBDBM50007163(2-(3,4-Dichloro-phenyl)-1-(1-pyrrolidin-1-ylmethyl...)
Affinity DataKi: >1.00E+3nM. Assay description: Affinity for opioid receptor mu sites
In DepthDetails ArticlePubMed