BDBM50007247 1,7,8-Trimethyl-1,3-dihydro-imidazo[4,5-b]quinolin-2-one::CHEMBL317604
SMILES Cc1ccc2nc3[nH]c(=O)n(C)c3cc2c1C
InChI Key InChIKey=PJRUEHQERHHYKI-UHFFFAOYSA-N
Data  2 IC50
  Tab Delimited (TSV)   2D SDfile   Computed 3D by Vconf -m prep SDfile
Find this compound or compounds like it in BindingDB:
Activity Spreadsheet -- Enzyme Inhibition Constant Data from BindingDB
Found 2 hits for monomerid = 50007247
TargetcGMP-inhibited 3',5'-cyclic phosphodiesterase 3A/3B(Homo sapiens (Human))
Bristol-Myers Squibb Pharmaceutical Research Institute
Curated by ChEMBL
LigandPNGBDBM50007247(1,7,8-Trimethyl-1,3-dihydro-imidazo[4,5-b]quinolin...)
Affinity DataIC50:  1.50E+3nM. Assay description: Inhibition of hydrolysis of c-AMP phosphodiesterase in human platelets
In DepthDetails ArticlePubMed
TargetcGMP-dependent 3',5'-cyclic phosphodiesterase(Homo sapiens (Human))
Bristol-Myers Squibb Pharmaceutical Research Institute
Curated by ChEMBL
LigandPNGBDBM50007247(1,7,8-Trimethyl-1,3-dihydro-imidazo[4,5-b]quinolin...)
Affinity DataIC50: >1.00E+5nM. Assay description: Inhibition of cGMP hydrolysis by human platelet phosphodiesterase
In DepthDetails ArticlePubMed