BDBM50007279 CHEMBL443275::Sodium; 6-{2-[cyclohexyl-(4-fluoro-phenyl)-methyl]-4,6-dimethyl-phenoxy}-3,5-dihydroxy-hexanoate
SMILES Cc1cc(C)c(OCC(O)C[C@@H](O)CC([O-])=O)c(c1)C(C1CCCCC1)c1ccc(F)cc1
InChI Key InChIKey=GVKPCBGAXFCUON-SVRAFRINSA-M
Data  1 IC50
  Tab Delimited (TSV)   2D SDfile   Computed 3D by Vconf -m prep SDfile
Find this compound or compounds like it in BindingDB:
Activity Spreadsheet -- Enzyme Inhibition Constant Data from BindingDB
Found 1 hit for monomerid = 50007279
Target3-hydroxy-3-methylglutaryl-coenzyme A reductase(Rattus norvegicus (rat))
Hoechst
Curated by ChEMBL
LigandPNGBDBM50007279(CHEMBL443275 | Sodium; 6-{2-[cyclohexyl-(4-fluoro-...)
Affinity DataIC50:  95nM. Assay description: In vitro inhibition of HMG-CoA reductase in solubilized rat liver.
In DepthDetails ArticlePubMed