BDBM50007290 CHEMBL100357::Sodium; 6-{2-[bis-(4-fluoro-phenyl)-methyl]-4-chloro-6-methyl-phenoxy}-3,5-dihydroxy-hexanoate
SMILES Cc1cc(Cl)cc(C(c2ccc(F)cc2)c2ccc(F)cc2)c1OCC(O)C[C@@H](O)CC([O-])=O
InChI Key InChIKey=RGJLCDJTSHNOSR-ZMFCMNQTSA-M
Data  1 IC50
  Tab Delimited (TSV)   2D SDfile   Computed 3D by Vconf -m prep SDfile
Find this compound or compounds like it in BindingDB:
Activity Spreadsheet -- Enzyme Inhibition Constant Data from BindingDB
Found 1 hit for monomerid = 50007290
Target3-hydroxy-3-methylglutaryl-coenzyme A reductase(Rattus norvegicus (rat))
Hoechst
Curated by ChEMBL
LigandPNGBDBM50007290(CHEMBL100357 | Sodium; 6-{2-[bis-(4-fluoro-phenyl)...)
Affinity DataIC50:  70nM. Assay description: In vitro inhibition of HMG-CoA reductase in solubilized rat liver.
In DepthDetails ArticlePubMed