BDBM50007297 CHEMBL2367825::Sodium; 7-(3,5-dichloro-4'-fluoro-biphenyl-2-yl)-3,5-dihydroxy-hept-6-enoate
SMILES [Na+].O[C@H](C[C@H](O)\C=C\c1c(Cl)cc(Cl)cc1-c1ccc(F)cc1)CC([O-])=O
InChI Key InChIKey=YNSCOIWHLKTBIE-IYUPQLJSSA-M
Data  1 IC50
  Tab Delimited (TSV)   2D SDfile   Computed 3D by Vconf -m prep SDfile
Find this compound or compounds like it in BindingDB:
Activity Spreadsheet -- Enzyme Inhibition Constant Data from BindingDB
Found 1 hit for monomerid = 50007297
Target3-hydroxy-3-methylglutaryl-coenzyme A reductase(Rattus norvegicus (rat))
Hoechst
Curated by ChEMBL
LigandPNGBDBM50007297(CHEMBL2367825 | Sodium; 7-(3,5-dichloro-4'-fluoro-...)
Affinity DataIC50:  4.5nM. Assay description: In vitro inhibition of solubilized HMG-CoA reductase in rat liver.
In DepthDetails ArticlePubMed