BDBM50007306 CHEMBL316938::Sodium; 6-{2-[(4-fluoro-phenyl)-(4-methoxy-phenyl)-methyl]-4,6-dimethyl-phenoxy}-3,5-dihydroxy-hexanoate
SMILES COc1ccc(cc1)C(c1ccc(F)cc1)c1cc(C)cc(C)c1OCC(O)C[C@@H](O)CC([O-])=O
InChI Key InChIKey=IEMSSGCNYIGNPI-WXFIPNSDSA-M
Data  1 IC50
  Tab Delimited (TSV)   2D SDfile   Computed 3D by Vconf -m prep SDfile
Find this compound or compounds like it in BindingDB:
Activity Spreadsheet -- Enzyme Inhibition Constant Data from BindingDB
Found 1 hit for monomerid = 50007306
Target3-hydroxy-3-methylglutaryl-coenzyme A reductase(Rattus norvegicus (rat))
Hoechst
Curated by ChEMBL
LigandPNGBDBM50007306(CHEMBL316938 | Sodium; 6-{2-[(4-fluoro-phenyl)-(4-...)
Affinity DataIC50:  100nM. Assay description: In vitro inhibition of HMG-CoA reductase in solubilized rat liver.
In DepthDetails ArticlePubMed