BDBM50007319 CHEMBL103849::Cyclopropylmethyl-[2-(3,4-dichloro-phenyl)-ethyl]-(2-pyrrolidin-1-yl-cyclohexyl)-amine
SMILES Clc1ccc(CCN(CC2CC2)[C@@H]2CCCC[C@@H]2N2CCCC2)cc1Cl
InChI Key InChIKey=KUFHVKLXHYGCLV-FCHUYYIVSA-N
Data  1 KI
  Tab Delimited (TSV)   2D SDfile   Computed 3D by Vconf -m prep SDfile
Find this compound or compounds like it in BindingDB:
Activity Spreadsheet -- Enzyme Inhibition Constant Data from BindingDB
Found 1 hit for monomerid = 50007319
TargetSigma non-opioid intracellular receptor 1(Homo sapiens (Human))
National Institute Of Diabetes And Digestive And Kidney Diseases
Curated by ChEMBL
LigandPNGBDBM50007319(CHEMBL103849 | Cyclopropylmethyl-[2-(3,4-dichloro-...)
Affinity DataKi:  38nM. Assay description: Inhibiton of [3H]-(+)-3-PPP binding to sigma of guinea pig brain
In DepthDetails ArticlePubMed