BDBM50007321 CHEMBL316797::[2-(3,4-Dichloro-phenyl)-ethyl]-propyl-(2-pyrrolidin-1-yl-cyclohexyl)-amine
SMILES CCCN(CCc1ccc(Cl)c(Cl)c1)[C@@H]1CCCC[C@@H]1N1CCCC1
InChI Key InChIKey=SNRSWLYCALRVHB-RTWAWAEBSA-N
Data  1 KI
  Tab Delimited (TSV)   2D SDfile   Computed 3D by Vconf -m prep SDfile
Find this compound or compounds like it in BindingDB:
Activity Spreadsheet -- Enzyme Inhibition Constant Data from BindingDB
Found 1 hit for monomerid = 50007321
TargetSigma non-opioid intracellular receptor 1(Homo sapiens (Human))
National Institute Of Diabetes And Digestive And Kidney Diseases
Curated by ChEMBL
LigandPNGBDBM50007321(CHEMBL316797 | [2-(3,4-Dichloro-phenyl)-ethyl]-pro...)
Affinity DataKi:  56nM. Assay description: Inhibiton of [3H]-(+)-3-PPP binding to sigma of guinea pig brain
In DepthDetails ArticlePubMed