BDBM50007346 CHEMBL323472::N-[1-(3-Acetylamino-phenyl)-2-pyrrolidin-1-yl-ethyl]-2-(3,4-dichloro-phenyl)-N-methyl-acetamide
SMILES CN(C(CN1CCCC1)c1cccc(NC(C)=O)c1)C(=O)Cc1ccc(Cl)c(Cl)c1
InChI Key InChIKey=FCEBQYDCYXPCAL-UHFFFAOYSA-N
Data  1 IC50
  Tab Delimited (TSV)   2D SDfile   Computed 3D by Vconf -m prep SDfile
Find this compound or compounds like it in BindingDB:
Activity Spreadsheet -- Enzyme Inhibition Constant Data from BindingDB
Found 1 hit for monomerid = 50007346
TargetKappa-type opioid receptor(Cavia porcellus (domestic guinea pig))
Ici Pharmaceuticals Group
Curated by ChEMBL
LigandPNGBDBM50007346(CHEMBL323472 | N-[1-(3-Acetylamino-phenyl)-2-pyrro...)
Affinity DataIC50:  5.5nM. Assay description: Binding affinity against opioid receptor kappa in guinea pig brain membrane using [3H]bremazocine as the radioligand
In DepthDetails ArticlePubMed