BDBM50007353 2-(3,4-Dichloro-phenyl)-N-(1-diethylaminomethyl-2-methyl-propyl)-N-methyl-acetamide::CHEMBL110867
SMILES CCN(CC)C[C@H](C(C)C)N(C)C(=O)Cc1ccc(Cl)c(Cl)c1
InChI Key InChIKey=SVHPDAAYXWKFOA-QGZVFWFLSA-N
Data  1 IC50
  Tab Delimited (TSV)   2D SDfile   Computed 3D by Vconf -m prep SDfile
Find this compound or compounds like it in BindingDB:
Activity Spreadsheet -- Enzyme Inhibition Constant Data from BindingDB
Found 1 hit for monomerid = 50007353
TargetKappa-type opioid receptor(Cavia porcellus (domestic guinea pig))
Ici Pharmaceuticals Group
Curated by ChEMBL
LigandPNGBDBM50007353(2-(3,4-Dichloro-phenyl)-N-(1-diethylaminomethyl-2-...)
Affinity DataIC50:  81nM. Assay description: Binding affinity against opioid receptor kappa in guinea pig brain membrane using [3H]bremazocine as the radioligand
In DepthDetails ArticlePubMed