BDBM50007365 2-(4-Chloro-phenyl)-N-methyl-N-(2-methyl-1-pyrrolidin-1-ylmethyl-propyl)-acetamide::CHEMBL108618
SMILES CC(C)[C@@H](CN1CCCC1)N(C)C(=O)Cc1ccc(Cl)cc1
InChI Key InChIKey=FNMFSRSDQFHRQA-QGZVFWFLSA-N
Data  1 IC50
  Tab Delimited (TSV)   2D SDfile   Computed 3D by Vconf -m prep SDfile
Find this compound or compounds like it in BindingDB:
Activity Spreadsheet -- Enzyme Inhibition Constant Data from BindingDB
Found 1 hit for monomerid = 50007365
TargetKappa-type opioid receptor(Cavia porcellus (domestic guinea pig))
Ici Pharmaceuticals Group
Curated by ChEMBL
LigandPNGBDBM50007365(2-(4-Chloro-phenyl)-N-methyl-N-(2-methyl-1-pyrroli...)
Affinity DataIC50:  37nM. Assay description: Binding affinity against Opioid receptor kappa 1, in guinea pig brain membrane, using [3H]bremazocine as the radioligand.
In DepthDetails ArticlePubMed