BDBM50007370 2-(3,4-Dichloro-phenyl)-N-[1-(3-methoxy-phenyl)-2-pyrrolidin-1-yl-ethyl]-N-methyl-acetamide::CHEMBL105923
SMILES COc1cccc(c1)C(CN1CCCC1)N(C)C(=O)Cc1ccc(Cl)c(Cl)c1
InChI Key InChIKey=BCDKQQVLNARLAI-UHFFFAOYSA-N
Data  1 IC50
  Tab Delimited (TSV)   2D SDfile   Computed 3D by Vconf -m prep SDfile
Find this compound or compounds like it in BindingDB:
Activity Spreadsheet -- Enzyme Inhibition Constant Data from BindingDB
Found 1 hit for monomerid = 50007370
TargetKappa-type opioid receptor(Cavia porcellus (domestic guinea pig))
Ici Pharmaceuticals Group
Curated by ChEMBL
LigandPNGBDBM50007370(2-(3,4-Dichloro-phenyl)-N-[1-(3-methoxy-phenyl)-2-...)
Affinity DataIC50:  31nM. Assay description: Binding affinity against opioid receptor kappa in guinea pig brain membrane using [3H]bremazocine as the radioligand
In DepthDetails ArticlePubMed