BDBM50007371 2-(3,4-Dichloro-phenyl)-N-methyl-N-((R)-1-phenyl-2-pyrrolidin-1-yl-ethyl)-acetamide::2-(3,4-Dichloro-phenyl)-N-methyl-N-(1-phenyl-2-pyrrolidin-1-yl-ethyl)-acetamide::CHEMBL106345
SMILES CN([C@@H](CN1CCCC1)c1ccccc1)C(=O)Cc1ccc(Cl)c(Cl)c1
InChI Key InChIKey=AEJOEPSMZCEYJN-FQEVSTJZSA-N
Data  1 IC50
  Tab Delimited (TSV)   2D SDfile   Computed 3D by Vconf -m prep SDfile
Find this compound or compounds like it in BindingDB:
Activity Spreadsheet -- Enzyme Inhibition Constant Data from BindingDB
Found 1 hit for monomerid = 50007371
TargetKappa-type opioid receptor(Cavia porcellus (domestic guinea pig))
Ici Pharmaceuticals Group
Curated by ChEMBL
LigandPNGBDBM50007371(2-(3,4-Dichloro-phenyl)-N-methyl-N-((R)-1-phenyl-2...)
Affinity DataIC50:  2.75E+3nM. Assay description: Binding affinity against opioid receptor kappa, in guinea pig brain membrane, using [3H]bremazocine as the radioligand.
In DepthDetails ArticlePubMed