BDBM50007375 2-(3,4-Dichloro-phenyl)-N-[1-(4-hydroxy-phenyl)-2-pyrrolidin-1-yl-ethyl]-N-methyl-acetamide::CHEMBL324411
SMILES CN(C(CN1CCCC1)c1ccc(O)cc1)C(=O)Cc1ccc(Cl)c(Cl)c1
InChI Key InChIKey=RHCHSSDSMMMVSJ-UHFFFAOYSA-N
Data  1 IC50
  Tab Delimited (TSV)   2D SDfile   Computed 3D by Vconf -m prep SDfile
Find this compound or compounds like it in BindingDB:
Activity Spreadsheet -- Enzyme Inhibition Constant Data from BindingDB
Found 1 hit for monomerid = 50007375
TargetKappa-type opioid receptor(Cavia porcellus (domestic guinea pig))
Ici Pharmaceuticals Group
Curated by ChEMBL
LigandPNGBDBM50007375(2-(3,4-Dichloro-phenyl)-N-[1-(4-hydroxy-phenyl)-2-...)
Affinity DataIC50:  9.80nM. Assay description: Binding affinity against opioid receptor kappa in guinea pig brain membrane using [3H]bremazocine as the radioligand
In DepthDetails ArticlePubMed