BDBM50007378 CHEMBL107543::N-Methyl-N-(2-methyl-1-pyrrolidin-1-ylmethyl-propyl)-2-phenoxy-acetamide
SMILES CC(C)[C@@H](CN1CCCC1)N(C)C(=O)COc1ccccc1
InChI Key InChIKey=IOIKZAWJOSFDMX-QGZVFWFLSA-N
Data  1 IC50
  Tab Delimited (TSV)   2D SDfile   Computed 3D by Vconf -m prep SDfile
Find this compound or compounds like it in BindingDB:
Activity Spreadsheet -- Enzyme Inhibition Constant Data from BindingDB
Found 1 hit for monomerid = 50007378
TargetKappa-type opioid receptor(Cavia porcellus (domestic guinea pig))
Ici Pharmaceuticals Group
Curated by ChEMBL
LigandPNGBDBM50007378(CHEMBL107543 | N-Methyl-N-(2-methyl-1-pyrrolidin-1...)
Affinity DataIC50:  21nM. Assay description: Binding affinity against opioid receptor kappa in guinea pig brain membrane using [3H]bremazocine as the radioligand
In DepthDetails ArticlePubMed