BDBM50007409 1-Naphthalen-2-yl-4-(3-phenyl-propyl)-piperazine::CHEMBL112574
SMILES C(CN1CCN(CC1)c1ccc2ccccc2c1)Cc1ccccc1
InChI Key InChIKey=HHQLJSVFIZMGCH-UHFFFAOYSA-N
Data  1 KI
  Tab Delimited (TSV)   2D SDfile   Computed 3D by Vconf -m prep SDfile
Find this compound or compounds like it in BindingDB:
Activity Spreadsheet -- Enzyme Inhibition Constant Data from BindingDB
Found 1 hit for monomerid = 50007409
TargetSigma non-opioid intracellular receptor 1(Homo sapiens (Human))
Virginia Commonwealth University
Curated by ChEMBL
LigandPNGBDBM50007409(1-Naphthalen-2-yl-4-(3-phenyl-propyl)-piperazine |...)
Affinity DataKi:  2.80nM. Assay description: Binding affinity of the compound towards sigma receptor in guinea pig brain membranes using [3H]-DTG as radioligand
In DepthDetails ArticlePubMed