BDBM50007455 1-[4-(8-Bromo-5,6-dihydro-benzo[5,6]cyclohepta[1,2-b]pyridin-11-ylidene)-piperidin-1-yl]-ethanone::CHEMBL142268
SMILES [#6]-[#6](=O)-[#7]-1-[#6]-[#6]\[#6](-[#6]-[#6]-1)=[#6]-1/c2ccc(Br)cc2-[#6]-[#6]-c2cccnc-12
InChI Key InChIKey=GXVUNIQJPJOXOM-UHFFFAOYSA-N
Data  1 IC50
  Tab Delimited (TSV)   2D SDfile   Computed 3D by Vconf -m prep SDfile
Find this compound or compounds like it in BindingDB:
Activity Spreadsheet -- Enzyme Inhibition Constant Data from BindingDB
Found 1 hit for monomerid = 50007455
TargetPlatelet-activating factor receptor(Homo sapiens (Human))
Schering-Plough
Curated by ChEMBL
LigandPNGBDBM50007455(1-[4-(8-Bromo-5,6-dihydro-benzo[5,6]cyclohepta[1,2...)
Affinity DataIC50:  810nM. Assay description: Concentration required to cause 50% inhibition of platelet activating factor (PAF)-induced platelet aggregation of human platelet rich plasma when ch...
In DepthDetails ArticlePubMed