BDBM50007492 8-{3-[4-(2-Methoxy-phenyl)-piperazin-1-yl]-propoxy}-8-aza-spiro[4.5]decan-7-one(HCl1.5H2O)::CHEMBL269458
SMILES COc1ccccc1N1CCN(CCCON2CCC3(CCCC3)CC2=O)CC1
InChI Key InChIKey=VWDWRPLKHXLHAD-UHFFFAOYSA-N
Data  3 IC50
  Tab Delimited (TSV)   2D SDfile   Computed 3D by Vconf -m prep SDfile
Find this compound or compounds like it in BindingDB:
Activity Spreadsheet -- Enzyme Inhibition Constant Data from BindingDB
Found 3 hits for monomerid = 50007492
TargetD(2) dopamine receptor(Rattus norvegicus (rat))
Hoechst-Roussel Pharmaceuticals
Curated by ChEMBL
LigandPNGBDBM50007492(8-{3-[4-(2-Methoxy-phenyl)-piperazin-1-yl]-propoxy...)
Affinity DataIC50:  720nM. Assay description: Compound was measured for affinity at dopamine receptor D2 labeled with [3H]spiroperidol radioligand in striatum tissue
In DepthDetails ArticlePubMed
TargetSerotonin 2 (5-HT2) receptor(RAT)
Hoechst-Roussel Pharmaceuticals
Curated by ChEMBL
LigandPNGBDBM50007492(8-{3-[4-(2-Methoxy-phenyl)-piperazin-1-yl]-propoxy...)
Affinity DataIC50:  2.70E+3nM. Assay description: Compound was measured for affinity at 5-hydroxytryptamine 2 receptor in rat cortical by [3H]spiroperidol displacement.
In DepthDetails ArticlePubMed
Target5-hydroxytryptamine receptor 1A(Rattus norvegicus (rat))
Hoechst-Roussel Pharmaceuticals
Curated by ChEMBL
LigandPNGBDBM50007492(8-{3-[4-(2-Methoxy-phenyl)-piperazin-1-yl]-propoxy...)
Affinity DataIC50:  70nM. Assay description: Affinity for 5-hydroxytryptamine 1A receptor labeled with [3H]8-OH-DPAT radioligand in hippocampus tissue
In DepthDetails ArticlePubMed