BDBM50007504 2-{3-[4-(3-Chloro-phenyl)-piperazin-1-yl]-propoxy}-isoindole-1,3-dione::CHEMBL10623
SMILES Clc1cccc(c1)N1CCN(CCCON2C(=O)c3ccccc3C2=O)CC1
InChI Key InChIKey=CPKTXABUZUYKSY-UHFFFAOYSA-N
Data  2 IC50
  Tab Delimited (TSV)   2D SDfile   Computed 3D by Vconf -m prep SDfile
Find this compound or compounds like it in BindingDB:
Activity Spreadsheet -- Enzyme Inhibition Constant Data from BindingDB
Found 2 hits for monomerid = 50007504
TargetD(2) dopamine receptor(Rattus norvegicus (rat))
Hoechst-Roussel Pharmaceuticals
Curated by ChEMBL
LigandPNGBDBM50007504(2-{3-[4-(3-Chloro-phenyl)-piperazin-1-yl]-propoxy}...)
Affinity DataIC50: >2.00E+4nM. Assay description: Compound was measured for affinity at dopamine receptor D2 labeled with [3H]spiroperidol radioligand in striatum tissue
In DepthDetails ArticlePubMed
Target5-hydroxytryptamine receptor 1A(Rattus norvegicus (rat))
Hoechst-Roussel Pharmaceuticals
Curated by ChEMBL
LigandPNGBDBM50007504(2-{3-[4-(3-Chloro-phenyl)-piperazin-1-yl]-propoxy}...)
Affinity DataIC50: >2.00E+4nM. Assay description: Affinity for 5-hydroxytryptamine 1A receptor labeled with [3H]8-OH-DPAT radioligand in hippocampus tissue
In DepthDetails ArticlePubMed