BDBM50007514 CHEMBL75842::N-(1-Benzyl-piperidin-4-yl)-5-bromo-2,3-dimethoxy-benzamide
SMILES COc1cc(Br)cc(C(=O)NC2CCN(Cc3ccccc3)CC2)c1OC
InChI Key InChIKey=SZYKUFQJFLQMPU-UHFFFAOYSA-N
Data  1 KI  2 IC50
  Tab Delimited (TSV)   2D SDfile   Computed 3D by Vconf -m prep SDfile
Find this compound or compounds like it in BindingDB:
Activity Spreadsheet -- Enzyme Inhibition Constant Data from BindingDB
Found 3 hits for monomerid = 50007514
TargetD(2) dopamine receptor(Rattus norvegicus (rat))
University Of Pennsylvania
Curated by ChEMBL
LigandPNGBDBM50007514(CHEMBL75842 | N-(1-Benzyl-piperidin-4-yl)-5-bromo-...)
Affinity DataKi:  0.310nM. Assay description: Inhibition of [125I]- NCQ 298 binding to D2 receptor of rat striatal tissue
In DepthDetails ArticlePubMed
TargetD(2) dopamine receptor(Rattus norvegicus (rat))
University Of Pennsylvania
Curated by ChEMBL
LigandPNGBDBM50007514(CHEMBL75842 | N-(1-Benzyl-piperidin-4-yl)-5-bromo-...)
Affinity DataIC50:  5nM. Assay description: The affinity for the Dopamine receptor D2 was assessed by the inhibition of [3H]-spiperone binding in rat striatal membranes in vitro.
In DepthDetails ArticlePubMed
TargetD(2) dopamine receptor(Rattus norvegicus (rat))
University Of Pennsylvania
Curated by ChEMBL
LigandPNGBDBM50007514(CHEMBL75842 | N-(1-Benzyl-piperidin-4-yl)-5-bromo-...)
Affinity DataIC50:  5nM. Assay description: Inhibition of [3H]spiperone binding to rat striatal dopamine receptor D2 was determined in vitro
In DepthDetails ArticlePubMed