BDBM50007541 3-Chloro-8-(2-dimethylamino-ethyl)-6-methyl-7,8-dihydro-6H-9-oxa-1,6-diaza-benzocycloheptene-5-thione::CHEMBL283760
SMILES CN(C)CC[C@H]1CN(C)C(=S)c2cc(Cl)cnc2O1
InChI Key InChIKey=MSWSTFGMFSCANV-JTQLQIEISA-N
Data  1 IC50
  Tab Delimited (TSV)   2D SDfile   Computed 3D by Vconf -m prep SDfile
Find this compound or compounds like it in BindingDB:
Activity Spreadsheet -- Enzyme Inhibition Constant Data from BindingDB
Found 1 hit for monomerid = 50007541
TargetHistamine H1 receptor(Cavia porcellus (domestic guinea pig))
A.H. Robins
Curated by ChEMBL
LigandPNGBDBM50007541(3-Chloro-8-(2-dimethylamino-ethyl)-6-methyl-7,8-di...)
Affinity DataIC50:  1.19E+4nM. Assay description: Inhibition of [3H]-mepyramine binding to the Histamine H1 receptor in guinea pig cortex
In DepthDetails ArticlePubMed