BDBM50007582 CHEMBL3238252
SMILES Cc1cc(NCCc2ccc(O)cc2)c2nncn2n1
InChI Key InChIKey=IRYZTIMDNVDWKI-UHFFFAOYSA-N
Data  8 IC50
PDB links: 1 PDB ID matches this monomer.
  Tab Delimited (TSV)   2D SDfile   Computed 3D by Vconf -m prep SDfile
Find this compound or compounds like it in BindingDB:
Activity Spreadsheet -- Enzyme Inhibition Constant Data from BindingDB
Found 8 hits for monomerid = 50007582
TargetPoly [ADP-ribose] polymerase tankyrase-1(Homo sapiens (Human))
Universit£
Curated by ChEMBL
LigandPNGBDBM50007582(CHEMBL3238252)
Affinity DataIC50:  12nM. Assay description: Inhibition of recombinant human TNKS-1
In DepthDetails ArticlePubMed
TargetPoly [ADP-ribose] polymerase tankyrase-2(Homo sapiens (Human))
Universit£
Curated by ChEMBL
LigandPNGBDBM50007582(CHEMBL3238252)
Affinity DataIC50:  200nM. Assay description: Inhibition of recombinant human TNKS-2
TargetPoly [ADP-ribose] polymerase 1(Homo sapiens (Human))
Universit£
Curated by ChEMBL
LigandPNGBDBM50007582(CHEMBL3238252)
Affinity DataIC50: >1.00E+4nM. Assay description: Inhibition of recombinant human PARP-1
In DepthDetails ArticlePubMed
TargetPoly [ADP-ribose] polymerase 2(Homo sapiens (Human))
University Of South Australia
Curated by ChEMBL
LigandPNGBDBM50007582(CHEMBL3238252)
Affinity DataIC50: >1.00E+4nM. Assay description: Inhibition of PAPR2 (unknown origin)
In DepthDetails PubMed
TargetPoly [ADP-ribose] polymerase tankyrase-1(Homo sapiens (Human))
Universit£
Curated by ChEMBL
LigandPNGBDBM50007582(CHEMBL3238252)
Affinity DataIC50:  12nM. Assay description: Inhibition of TNKS1 (unknown origin)
In DepthDetails PubMed
TargetPoly [ADP-ribose] polymerase tankyrase-2(Homo sapiens (Human))
Universit£
Curated by ChEMBL
LigandPNGBDBM50007582(CHEMBL3238252)
Affinity DataIC50:  200nM. Assay description: Inhibition of TNKS2 (unknown origin)
TargetPoly [ADP-ribose] polymerase 1(Homo sapiens (Human))
Universit£
Curated by ChEMBL
LigandPNGBDBM50007582(CHEMBL3238252)
Affinity DataIC50: >1.00E+4nM. Assay description: Inhibition of PARP1 (unknown origin)
In DepthDetails PubMed
TargetPoly [ADP-ribose] polymerase 2(Homo sapiens (Human))
University Of South Australia
Curated by ChEMBL
LigandPNGBDBM50007582(CHEMBL3238252)
Affinity DataIC50: >1.00E+4nM. Assay description: Inhibition of recombinant human PARP-2
In DepthDetails ArticlePubMed