BDBM50007723 CHEMBL3233447
SMILES CC(C)CCNC(=O)Cn1ccc(cc1=O)N1CCOCC1
InChI Key InChIKey=AVGAFYLVZSCIEW-UHFFFAOYSA-N
Data  1 KI
  Tab Delimited (TSV)   2D SDfile   Computed 3D by Vconf -m prep SDfile
Find this compound or compounds like it in BindingDB:
Activity Spreadsheet -- Enzyme Inhibition Constant Data from BindingDB
Found 1 hit for monomerid = 50007723
TargetProteasome subunit beta type-5(Homo sapiens (Human))
Universit£
Curated by ChEMBL
LigandPNGBDBM50007723(CHEMBL3233447)
Affinity DataKi:  7.67E+3nM. Assay description: Inhibition of chymotrypsin-like activity of human 20S proteasome beta 5 subunit assessed as Suc-Leu-Leu-Val-Tyr-AMC substrate hydrolysis after 10 min...
In DepthDetails ArticlePubMed