BDBM50007954 CHEMBL407023::pGlu-His-DHar(bCN)-Ser-Tyr-DArg-Leu-ILys-Pro-DAla-NH2
SMILES CCCCNC(NCCCC[C@@H](NC(=O)[C@H](Cc1cnc[nH]1)NC(=O)[C@@H]1CCC(=O)N1)C(=O)N[C@@H](CO)C(=O)N[C@@H](Cc1ccc(O)cc1)C(=O)N[C@H](CCCNC(N)=N)C(=O)N[C@@H](CC(C)C)C(=O)N[C@@H](CCCCNC(C)C)C(=O)N1CCC[C@H]1C(=O)N[C@H](C)C(N)=O)=NC#N
InChI Key InChIKey=AMKZOUFNTFUDBV-ZIXRLVEISA-N
Data  1 Kd
  Tab Delimited (TSV)   2D SDfile   Computed 3D by Vconf -m prep SDfile
Find this compound or compounds like it in BindingDB:
Activity Spreadsheet -- Enzyme Inhibition Constant Data from BindingDB
Found 1 hit for monomerid = 50007954
TargetGonadotropin-releasing hormone receptor(Rattus norvegicus)
Salk Institute
Curated by ChEMBL
LigandPNGBDBM50007954(CHEMBL407023 | pGlu-His-DHar(bCN)-Ser-Tyr-DArg-Leu...)
Affinity DataKd:  1.20nM. Assay description: In vitro binding affinity of Gonadotropin-releasing hormone antagonist was measured in rat pituitary cell membranes
In DepthDetails ArticlePubMed