BDBM50008037 3-Benzoyloxy-8-methyl-8-aza-bicyclo[3.2.1]octane-2-carboxylic acid ethyl ester::CHEMBL416764
SMILES CCOC(=O)C1C2CC[C@H](C[C@@H]1OC(=O)c1ccccc1)N2C
InChI Key InChIKey=NMPOSNRHZIWLLL-CIDNJEQPSA-N
Data  1 IC50
  Tab Delimited (TSV)   2D SDfile   Computed 3D by Vconf -m prep SDfile
Find this compound or compounds like it in BindingDB:
Activity Spreadsheet -- Enzyme Inhibition Constant Data from BindingDB
Found 1 hit for monomerid = 50008037
TargetSodium-dependent dopamine transporter(Rattus norvegicus (rat))
Research Triangle Institute
Curated by ChEMBL
LigandPNGBDBM50008037(3-Benzoyloxy-8-methyl-8-aza-bicyclo[3.2.1]octane-2...)
Affinity DataIC50:  130nM. Assay description: Inhibition of [3H]3-beta-(p-fluorophenyl)tropane-2beta-carboxylic acid methyl ester binding to Dopamine transporter in rat striatal membranes.
In DepthDetails ArticlePubMed