BDBM50008067 3-Ethyl-4-(3-methyl-3H-imidazol-4-ylmethyl)-pyrrolidin-2-one::CHEMBL329000
SMILES CC[C@@H]1[C@@H](Cc2cncn2C)CNC1=O
InChI Key InChIKey=LWYKXKGPFMXVIY-WCBMZHEXSA-N
Data  2 IC50
  Tab Delimited (TSV)   2D SDfile   Computed 3D by Vconf -m prep SDfile
Find this compound or compounds like it in BindingDB:
Activity Spreadsheet -- Enzyme Inhibition Constant Data from BindingDB
Found 2 hits for monomerid = 50008067
LigandPNGBDBM50008067(3-Ethyl-4-(3-methyl-3H-imidazol-4-ylmethyl)-pyrrol...)
Affinity DataIC50:  800nM. Assay description: Ability to displace [3H]cis--2-methyl-5-((dimethylamino)methyl)-1,3-di oxolane from muscarinic acetylcholine receptor in rat cortical tissue.
In DepthDetails ArticlePubMed
TargetMuscarinic acetylcholine receptor M1(RAT)
Sandoz Pharma
Curated by ChEMBL
LigandPNGBDBM50008067(3-Ethyl-4-(3-methyl-3H-imidazol-4-ylmethyl)-pyrrol...)
Affinity DataIC50:  9.95E+3nM. Assay description: Ability to displace [3H]-pirenzepine (pir) from muscarinic acetylcholine receptor M1 in rat cortical tissue.
In DepthDetails ArticlePubMed