BDBM50008070 3-Ethyl-4-(3-methyl-3H-imidazol-4-ylmethyl)-dihydro-thiophen-2-one::CHEMBL313227
SMILES CC[C@H]1[C@@H](Cc2cncn2C)CSC1=O
InChI Key InChIKey=JEKWFJIPBJGBJT-WPRPVWTQSA-N
Data  2 IC50
  Tab Delimited (TSV)   2D SDfile   Computed 3D by Vconf -m prep SDfile
Find this compound or compounds like it in BindingDB:
Activity Spreadsheet -- Enzyme Inhibition Constant Data from BindingDB
Found 2 hits for monomerid = 50008070
LigandPNGBDBM50008070(3-Ethyl-4-(3-methyl-3H-imidazol-4-ylmethyl)-dihydr...)
Affinity DataIC50:  54nM. Assay description: Central presynaptic activity as effect on electrically evoked acetylcholine release from rat hippocampal slices (M2 model)
In DepthDetails ArticlePubMed
TargetMuscarinic acetylcholine receptor M1(RAT)
Sandoz Pharma
Curated by ChEMBL
LigandPNGBDBM50008070(3-Ethyl-4-(3-methyl-3H-imidazol-4-ylmethyl)-dihydr...)
Affinity DataIC50:  435nM. Assay description: Ability to displace [3H]-pirenzepine (pir) from muscarinic acetylcholine receptor M1 in rat cortical tissue.
In DepthDetails ArticlePubMed