BDBM50008190 4-(2-Adamantan-1-yl-ethylcarbamoyl)-4-(3-chloro-benzoylamino)-butyric acid::CHEMBL125874
SMILES OC(=O)CCC(NC(=O)c1cccc(Cl)c1)C(=O)NCCC12CC3CC(CC(C3)C1)C2
InChI Key InChIKey=GQTLZKYIRBHVJK-UHFFFAOYSA-N
Data  3 IC50
  Tab Delimited (TSV)   2D SDfile   Computed 3D by Vconf -m prep SDfile
Find this compound or compounds like it in BindingDB:
Activity Spreadsheet -- Enzyme Inhibition Constant Data from BindingDB
Found 3 hits for monomerid = 50008190
TargetGastrin/cholecystokinin type B receptor(RAT)
Rotta Research Laboratorium
Curated by ChEMBL
LigandPNGBDBM50008190(4-(2-Adamantan-1-yl-ethylcarbamoyl)-4-(3-chloro-be...)
Affinity DataIC50:  400nM. Assay description: Inhibition of the specific binding of [125I](BH)-CCK-8 to Cholecystokinin type B receptor in rat brain cortex
In DepthDetails ArticlePubMed
TargetCholecystokinin receptor type A(RAT)
Rotta Research Laboratorium
Curated by ChEMBL
LigandPNGBDBM50008190(4-(2-Adamantan-1-yl-ethylcarbamoyl)-4-(3-chloro-be...)
Affinity DataIC50:  3.33E+4nM. Assay description: Concentration required to inhibit by 50% specific binding of [125I](BH)-CCK-8 to cholecystokinin type A receptor in rat pancreatic acini
In DepthDetails ArticlePubMed
TargetGastrin/cholecystokinin type B receptor(Homo sapiens (Human))
Rotta Research Laboratorium
Curated by ChEMBL
LigandPNGBDBM50008190(4-(2-Adamantan-1-yl-ethylcarbamoyl)-4-(3-chloro-be...)
Affinity DataIC50:  8.30E+3nM. Assay description: Concentration required to inhibit by 50% the specific binding of [3H]pentagastrin to Cholecystokinin type B receptor in rabbit gastric gland
In DepthDetails ArticlePubMed