BDBM50008191 4-(3,4-Dichloro-benzoylamino)-4-(3,3-dimethyl-butylcarbamoyl)-butyric acid::CHEMBL125551
SMILES CC(C)(C)CCNC(=O)C(CCC(O)=O)NC(=O)c1ccc(Cl)c(Cl)c1
InChI Key InChIKey=SCRVQDXDXQWJKU-UHFFFAOYSA-N
Data  2 IC50
  Tab Delimited (TSV)   2D SDfile   Computed 3D by Vconf -m prep SDfile
Find this compound or compounds like it in BindingDB:
Activity Spreadsheet -- Enzyme Inhibition Constant Data from BindingDB
Found 2 hits for monomerid = 50008191
TargetGastrin/cholecystokinin type B receptor(RAT)
Rotta Research Laboratorium
Curated by ChEMBL
LigandPNGBDBM50008191(4-(3,4-Dichloro-benzoylamino)-4-(3,3-dimethyl-buty...)
Affinity DataIC50:  3.10E+3nM. Assay description: Inhibition of the specific binding of [125I](BH)-CCK-8 to Cholecystokinin type B receptor in rat brain cortex
In DepthDetails ArticlePubMed
TargetCholecystokinin receptor type A(RAT)
Rotta Research Laboratorium
Curated by ChEMBL
LigandPNGBDBM50008191(4-(3,4-Dichloro-benzoylamino)-4-(3,3-dimethyl-buty...)
Affinity DataIC50:  1.88E+4nM. Assay description: Concentration required to inhibit by 50% specific binding of [125I](BH)-CCK-8 to cholecystokinin type A receptor in rat pancreatic acini
In DepthDetails ArticlePubMed