BDBM50008197 4-(3-Chloro-benzoylamino)-5-(decahydro-isoquinolin-3-yl)-5-oxo-pentanoic acid::CHEMBL124780
SMILES OC(=O)CCC(NC(=O)c1cccc(Cl)c1)C(=O)C1CC2CCCCC2CN1
InChI Key InChIKey=WAFAESIQVGUZCU-UHFFFAOYSA-N
Data  2 IC50
  Tab Delimited (TSV)   2D SDfile   Computed 3D by Vconf -m prep SDfile
Find this compound or compounds like it in BindingDB:
Activity Spreadsheet -- Enzyme Inhibition Constant Data from BindingDB
Found 2 hits for monomerid = 50008197
TargetCholecystokinin receptor type A(RAT)
Rotta Research Laboratorium
Curated by ChEMBL
LigandPNGBDBM50008197(4-(3-Chloro-benzoylamino)-5-(decahydro-isoquinolin...)
Affinity DataIC50:  8.88E+4nM. Assay description: Concentration required to inhibit by 50% specific binding of [125I](BH)-CCK-8 to cholecystokinin type A receptor in rat pancreatic acini
In DepthDetails ArticlePubMed
TargetGastrin/cholecystokinin type B receptor(RAT)
Rotta Research Laboratorium
Curated by ChEMBL
LigandPNGBDBM50008197(4-(3-Chloro-benzoylamino)-5-(decahydro-isoquinolin...)
Affinity DataIC50:  2.30E+3nM. Assay description: Inhibition of the specific binding of [125I](BH)-CCK-8 to Cholecystokinin type B receptor in rat brain cortex
In DepthDetails ArticlePubMed