BDBM50008198 4-(8-Aza-spiro[4.5]dec-8-ylcarbamoyl)-4-(3,4-dichloro-benzoylamino)-butyric acid::CHEMBL340463
SMILES OC(=O)CCC(NC(=O)c1ccc(Cl)c(Cl)c1)C(=O)NN1CCC2(CCCC2)CC1
InChI Key InChIKey=LULLDEXWZKPRBP-UHFFFAOYSA-N
Data  2 IC50
  Tab Delimited (TSV)   2D SDfile   Computed 3D by Vconf -m prep SDfile
Find this compound or compounds like it in BindingDB:
Activity Spreadsheet -- Enzyme Inhibition Constant Data from BindingDB
Found 2 hits for monomerid = 50008198
TargetGastrin/cholecystokinin type B receptor(RAT)
Rotta Research Laboratorium
Curated by ChEMBL
LigandPNGBDBM50008198(4-(8-Aza-spiro[4.5]dec-8-ylcarbamoyl)-4-(3,4-dichl...)
Affinity DataIC50:  500nM. Assay description: Inhibition of the specific binding of [125I](BH)-CCK-8 to Cholecystokinin type B receptor in rat brain cortex
In DepthDetails ArticlePubMed
TargetCholecystokinin receptor type A(RAT)
Rotta Research Laboratorium
Curated by ChEMBL
LigandPNGBDBM50008198(4-(8-Aza-spiro[4.5]dec-8-ylcarbamoyl)-4-(3,4-dichl...)
Affinity DataIC50:  1.30E+3nM. Assay description: Concentration required to inhibit by 50% specific binding of [125I](BH)-CCK-8 to cholecystokinin type A receptor in rat pancreatic acini
In DepthDetails ArticlePubMed