BDBM50008386 3,7-Dimethyl-1-prop-2-ynyl-3,7-dihydro-purine-2,6-dione::CHEMBL282038
SMILES Cn1cnc2n(C)c(=O)n(CC#C)c(=O)c12
InChI Key InChIKey=IORPOFJLSIHJOG-UHFFFAOYSA-N
Data  16 KI  2 IC50
  Tab Delimited (TSV)   2D SDfile   Computed 3D by Vconf -m prep SDfile
Find this compound or compounds like it in BindingDB:
Activity Spreadsheet -- Enzyme Inhibition Constant Data from BindingDB
Found 18 hits for monomerid = 50008386
TargetAdenosine receptor A2b(Homo sapiens (Human))
University Of Bonn
Curated by ChEMBL
LigandPNGBDBM50008386(3,7-Dimethyl-1-prop-2-ynyl-3,7-dihydro-purine-2,6-...)
Affinity DataKi:  4.13E+3nM. Assay description: Displacement of [3H]PSB-603 from human adenosine A2B receptor
In DepthDetails ArticlePubMed
TargetAdenosine receptor A2b(Homo sapiens (Human))
University Of Bonn
Curated by ChEMBL
LigandPNGBDBM50008386(3,7-Dimethyl-1-prop-2-ynyl-3,7-dihydro-purine-2,6-...)
Affinity DataKi:  4.13E+3nM. Assay description: Binding affinity to human adenosine A2B receptor
In DepthDetails ArticlePubMed
TargetAdenosine receptor A2b(Homo sapiens (Human))
University Of Bonn
Curated by ChEMBL
LigandPNGBDBM50008386(3,7-Dimethyl-1-prop-2-ynyl-3,7-dihydro-purine-2,6-...)
Affinity DataKi:  4.13E+3nM. Assay description: Binding affinity at human Adenosine A2B receptor expressed in HEK-293 cells, using [125I]-ABOPX as radioligand
In DepthDetails ArticlePubMed
TargetAdenosine receptor A2a(Rattus norvegicus (rat))
University Of Bonn
Curated by ChEMBL
LigandPNGBDBM50008386(3,7-Dimethyl-1-prop-2-ynyl-3,7-dihydro-purine-2,6-...)
Affinity DataKi:  5.60E+3nM. Assay description: Binding affinity to rat adenosine A2A receptor
In DepthDetails ArticlePubMed
TargetAdenosine receptor A2a(Rattus norvegicus (rat))
University Of Bonn
Curated by ChEMBL
LigandPNGBDBM50008386(3,7-Dimethyl-1-prop-2-ynyl-3,7-dihydro-purine-2,6-...)
Affinity DataKi:  5.60E+3nM. Assay description: Displacement of [3H]MSX-2 from adenosine A2A receptor in rat brain striatum
In DepthDetails ArticlePubMed
TargetAdenosine receptor A2a(GUINEA PIG)
TBA
Curated by ChEMBL
LigandPNGBDBM50008386(3,7-Dimethyl-1-prop-2-ynyl-3,7-dihydro-purine-2,6-...)
Affinity DataKi:  6.00E+3nM. Assay description: Compound was evaluated for its ability to antagonise cyclic [3H]-AMP accumulation in [3H]-adenine-labeled guinea pig cerebral cortical slices.
In DepthDetails ArticlePubMed
TargetAdenosine receptor A2a(Rattus norvegicus (rat))
University Of Bonn
Curated by ChEMBL
LigandPNGBDBM50008386(3,7-Dimethyl-1-prop-2-ynyl-3,7-dihydro-purine-2,6-...)
Affinity DataKi:  8.60E+3nM. Assay description: Ability to inhibit binding of [3H]-CGS- 21680 to adenosine A2A receptor in rat brain striatal membranes.
In DepthDetails ArticlePubMed
TargetAdenosine receptor A3(Homo sapiens (Human))
University Of Bonn
Curated by ChEMBL
LigandPNGBDBM50008386(3,7-Dimethyl-1-prop-2-ynyl-3,7-dihydro-purine-2,6-...)
Affinity DataKi: >1.00E+4nM. Assay description: Displacement of [3H]PSB-11 from human adenosine A3 receptor expressed in CHO cells
In DepthDetails ArticlePubMed
TargetAdenosine receptor A3(Rattus norvegicus)
University Of Bonn
Curated by ChEMBL
LigandPNGBDBM50008386(3,7-Dimethyl-1-prop-2-ynyl-3,7-dihydro-purine-2,6-...)
Affinity DataKi: >1.00E+4nM. Assay description: Binding affinity to rat adenosine A3 receptor
In DepthDetails ArticlePubMed
TargetAdenosine receptor A1(Rattus norvegicus (rat))
University Of Bonn
Curated by ChEMBL
LigandPNGBDBM50008386(3,7-Dimethyl-1-prop-2-ynyl-3,7-dihydro-purine-2,6-...)
Affinity DataKi:  1.10E+4nM. Assay description: Displacement of [3H]CCPA from adenosine A1 receptor in rat brain cortex
In DepthDetails ArticlePubMed
TargetAdenosine receptor A1(Rattus norvegicus (rat))
University Of Bonn
Curated by ChEMBL
LigandPNGBDBM50008386(3,7-Dimethyl-1-prop-2-ynyl-3,7-dihydro-purine-2,6-...)
Affinity DataKi:  1.10E+4nM. Assay description: Binding affinity to rat adenosine A1 receptor
In DepthDetails ArticlePubMed
TargetAdenosine receptor A1(Rattus norvegicus (rat))
University Of Bonn
Curated by ChEMBL
LigandPNGBDBM50008386(3,7-Dimethyl-1-prop-2-ynyl-3,7-dihydro-purine-2,6-...)
Affinity DataKi:  1.20E+4nM. Assay description: Ability to inhibit binding of [3H]-CHA to adenosine A1 receptor in rat brain cortical membranes.
In DepthDetails ArticlePubMed
TargetAdenosine receptor A2a(Rattus norvegicus (rat))
University Of Bonn
Curated by ChEMBL
LigandPNGBDBM50008386(3,7-Dimethyl-1-prop-2-ynyl-3,7-dihydro-purine-2,6-...)
Affinity DataKi:  1.60E+4nM. Assay description: Ability to inhibit binding of [3H]-NECA to Adenosine A2A receptor in rat brain striatal membranes
In DepthDetails ArticlePubMed
TargetAdenosine receptor A1(Rattus norvegicus (rat))
University Of Bonn
Curated by ChEMBL
LigandPNGBDBM50008386(3,7-Dimethyl-1-prop-2-ynyl-3,7-dihydro-purine-2,6-...)
Affinity DataKi:  2.20E+4nM. Assay description: Binding affinity against adenosine A1 receptor using [3H]-CHA or [3H]PIA as radioligand
In DepthDetails ArticlePubMed
TargetAdenosine receptor A1(Rattus norvegicus (rat))
University Of Bonn
Curated by ChEMBL
LigandPNGBDBM50008386(3,7-Dimethyl-1-prop-2-ynyl-3,7-dihydro-purine-2,6-...)
Affinity DataKi:  4.50E+4nM. Assay description: Ability to inhibit binding of 1 nM [3H]-cyclohexyladenosine to adenosine A1 receptor in rat cerebral cortical membranes
In DepthDetails ArticlePubMed
TargetAdenosine receptor A1(Rattus norvegicus (rat))
University Of Bonn
Curated by ChEMBL
LigandPNGBDBM50008386(3,7-Dimethyl-1-prop-2-ynyl-3,7-dihydro-purine-2,6-...)
Affinity DataKi:  4.50E+4nM. Assay description: Ability to inhibit binding of [3H]-R-PIA to Adenosine A1 receptor in rat brain cortical membranes
In DepthDetails ArticlePubMed
TargetAmine oxidase [flavin-containing] A(Homo sapiens (Human))
University Of Bonn
Curated by ChEMBL
LigandPNGBDBM50008386(3,7-Dimethyl-1-prop-2-ynyl-3,7-dihydro-purine-2,6-...)
Affinity DataIC50: >1.00E+4nM. Assay description: Inhibition of human MAO-A
In DepthDetails ArticlePubMed
TargetAmine oxidase [flavin-containing] B(Homo sapiens (Human))
University Of Bonn
Curated by ChEMBL
LigandPNGBDBM50008386(3,7-Dimethyl-1-prop-2-ynyl-3,7-dihydro-purine-2,6-...)
Affinity DataIC50: >1.00E+4nM. Assay description: Inhibition of human MAO-B
In DepthDetails ArticlePubMed