BDBM50008388 3-[2-(4-Amino-3-iodo-phenyl)-ethyl]-8-cyclopentyl-1-propyl-3,7-dihydro-purine-2,6-dione::CHEMBL334776
SMILES CCCn1c(=O)n(CCc2ccc(N)c(I)c2)c2nc([nH]c2c1=O)C1CCCC1
InChI Key InChIKey=AZWSEPNWIHTUNW-UHFFFAOYSA-N
Data  1 KI
  Tab Delimited (TSV)   2D SDfile   Computed 3D by Vconf -m prep SDfile
Find this compound or compounds like it in BindingDB:
Activity Spreadsheet -- Enzyme Inhibition Constant Data from BindingDB
Found 1 hit for monomerid = 50008388
TargetAdenosine receptor A1(Rattus norvegicus (rat))
Niddk
Curated by ChEMBL
LigandPNGBDBM50008388(3-[2-(4-Amino-3-iodo-phenyl)-ethyl]-8-cyclopentyl-...)
Affinity DataKi:  0.230nM. Assay description: Binding affinity against adenosine A1 receptor using [3H]-CHA or [3H]PIA as radioligand
In DepthDetails ArticlePubMed