BDBM50008460 CHEMBL143387::{3-[2-(2-Fluoro-phenyl)-thiazol-4-ylmethyl]-4-oxo-3,4-dihydro-phthalazin-1-yl}-acetic acid
SMILES OC(=O)Cc1nn(Cc2csc(n2)-c2ccccc2F)c(=O)c2ccccc12
InChI Key InChIKey=CKFALBKFAWADSG-UHFFFAOYSA-N
Data  1 IC50
  Tab Delimited (TSV)   2D SDfile   Computed 3D by Vconf -m prep SDfile
Find this compound or compounds like it in BindingDB:
Activity Spreadsheet -- Enzyme Inhibition Constant Data from BindingDB
Found 1 hit for monomerid = 50008460
TargetAldo-keto reductase family 1 member B1(Homo sapiens (Human))
Pfizer
Curated by ChEMBL
LigandPNGBDBM50008460(CHEMBL143387 | {3-[2-(2-Fluoro-phenyl)-thiazol-4-y...)
Affinity DataIC50:  460nM. Assay description: In vitro inhibitory activity against aldose reductase isolated from human placenta
In DepthDetails ArticlePubMed