BDBM50008478 CHEMBL142989::[4-Oxo-3-(5-trifluoromethyl-benzooxazol-2-ylmethyl)-3,4-dihydro-phthalazin-1-yl]-acetic acid
SMILES OC(=O)Cc1nn(Cc2nc3cc(ccc3o2)C(F)(F)F)c(=O)c2ccccc12
InChI Key InChIKey=QKRGDZKQCDTVMW-UHFFFAOYSA-N
Data  1 IC50
  Tab Delimited (TSV)   2D SDfile   Computed 3D by Vconf -m prep SDfile
Find this compound or compounds like it in BindingDB:
Activity Spreadsheet -- Enzyme Inhibition Constant Data from BindingDB
Found 1 hit for monomerid = 50008478
TargetAldo-keto reductase family 1 member B1(Homo sapiens (Human))
Pfizer
Curated by ChEMBL
LigandPNGBDBM50008478(CHEMBL142989 | [4-Oxo-3-(5-trifluoromethyl-benzoox...)
Affinity DataIC50:  31nM. Assay description: In vitro inhibitory activity against aldose reductase isolated from human placenta
In DepthDetails ArticlePubMed