BDBM50008479 CHEMBL143098::{3-[3-(2,3-Difluoro-phenyl)-[1,2,4]oxadiazol-5-ylmethyl]-4-oxo-3,4-dihydro-phthalazin-1-yl}-acetic acid
SMILES OC(=O)Cc1nn(Cc2nc(no2)-c2cccc(F)c2F)c(=O)c2ccccc12
InChI Key InChIKey=UXDVIJPPULWUMJ-UHFFFAOYSA-N
Data  1 IC50
  Tab Delimited (TSV)   2D SDfile   Computed 3D by Vconf -m prep SDfile
Find this compound or compounds like it in BindingDB:
Activity Spreadsheet -- Enzyme Inhibition Constant Data from BindingDB
Found 1 hit for monomerid = 50008479
TargetAldo-keto reductase family 1 member B1(Homo sapiens (Human))
Pfizer
Curated by ChEMBL
LigandPNGBDBM50008479(CHEMBL143098 | {3-[3-(2,3-Difluoro-phenyl)-[1,2,4]...)
Affinity DataIC50:  19nM. Assay description: In vitro inhibitory activity against aldose reductase isolated from human placenta
In DepthDetails ArticlePubMed