BDBM50008484 CHEMBL344057::{4-Oxo-3-[(3-trifluoromethyl-phenylcarbamoyl)-methyl]-3,4-dihydro-phthalazin-1-yl}-acetic acid
SMILES OC(=O)Cc1nn(CC(=O)Nc2cccc(c2)C(F)(F)F)c(=O)c2ccccc12
InChI Key InChIKey=TVFSNNWYDVKQPM-UHFFFAOYSA-N
Data  1 IC50
  Tab Delimited (TSV)   2D SDfile   Computed 3D by Vconf -m prep SDfile
Find this compound or compounds like it in BindingDB:
Activity Spreadsheet -- Enzyme Inhibition Constant Data from BindingDB
Found 1 hit for monomerid = 50008484
TargetAldo-keto reductase family 1 member B1(Homo sapiens (Human))
Pfizer
Curated by ChEMBL
LigandPNGBDBM50008484(CHEMBL344057 | {4-Oxo-3-[(3-trifluoromethyl-phenyl...)
Affinity DataIC50:  19nM. Assay description: In vitro inhibitory activity against aldose reductase isolated from human placenta
In DepthDetails ArticlePubMed