BDBM50008570 4-Methyl-1-(2-methyl-benzyl)-piperidine::CHEMBL158174
SMILES CC1CCN(Cc2ccccc2C)CC1
InChI Key InChIKey=YNIWJICOZIEUOZ-UHFFFAOYSA-N
Data  1 IC50
  Tab Delimited (TSV)   2D SDfile   Computed 3D by Vconf -m prep SDfile
Find this compound or compounds like it in BindingDB:
Activity Spreadsheet -- Enzyme Inhibition Constant Data from BindingDB
Found 1 hit for monomerid = 50008570
TargetAcetylcholinesterase(Homo sapiens (Human))
University Of Illinois
Curated by ChEMBL
LigandPNGBDBM50008570(4-Methyl-1-(2-methyl-benzyl)-piperidine | CHEMBL15...)
Affinity DataIC50:  10nM. Assay description: Inhibition of acetylcholinesterase activity
In DepthDetails ArticlePubMed