BDBM50008577 4-Methyl-1-(2-nitro-benzyl)-piperidine::CHEMBL347354
SMILES CC1CCN(Cc2ccccc2[N+]([O-])=O)CC1
InChI Key InChIKey=ZUBDLZIJXZLHIZ-UHFFFAOYSA-N
Data  1 IC50
  Tab Delimited (TSV)   2D SDfile   Computed 3D by Vconf -m prep SDfile
Find this compound or compounds like it in BindingDB:
Activity Spreadsheet -- Enzyme Inhibition Constant Data from BindingDB
Found 1 hit for monomerid = 50008577
TargetAcetylcholinesterase(Homo sapiens (Human))
University Of Illinois
Curated by ChEMBL
LigandPNGBDBM50008577(4-Methyl-1-(2-nitro-benzyl)-piperidine | CHEMBL347...)
Affinity DataIC50:  160nM. Assay description: Inhibition of acetylcholinesterase activity
In DepthDetails ArticlePubMed