BDBM50008581 (4-Methyl-piperidin-1-yl)-phenyl-methanone::CHEMBL155768
SMILES CC1CCN(CC1)C(=O)c1ccccc1
InChI Key InChIKey=BAXKIBHBAJDALN-UHFFFAOYSA-N
Data  1 IC50
  Tab Delimited (TSV)   2D SDfile   Computed 3D by Vconf -m prep SDfile
Find this compound or compounds like it in BindingDB:
Activity Spreadsheet -- Enzyme Inhibition Constant Data from BindingDB
Found 1 hit for monomerid = 50008581
TargetAcetylcholinesterase(Homo sapiens (Human))
University Of Illinois
Curated by ChEMBL
LigandPNGBDBM50008581((4-Methyl-piperidin-1-yl)-phenyl-methanone | CHEMB...)
Affinity DataIC50:  1.00E+4nM. Assay description: Inhibition of acetylcholinesterase activity
In DepthDetails ArticlePubMed