BDBM50008615 2-(2-Mercaptomethyl-5-phenyl-pentanoylamino)-ethanesulfonic acid (0.75H2O)::CHEMBL158015
SMILES OS(=O)(=O)CCNC(=O)C(CS)CCCc1ccccc1
InChI Key InChIKey=CQQVIDQRMWAWPX-UHFFFAOYSA-N
Data  1 IC50
  Tab Delimited (TSV)   2D SDfile   Computed 3D by Vconf -m prep SDfile
Find this compound or compounds like it in BindingDB:
Activity Spreadsheet -- Enzyme Inhibition Constant Data from BindingDB
Found 1 hit for monomerid = 50008615
TargetNeprilysin(Rattus norvegicus (Rat))
Dainippon Pharmaceutical
Curated by ChEMBL
LigandPNGBDBM50008615(2-(2-Mercaptomethyl-5-phenyl-pentanoylamino)-ethan...)
Affinity DataIC50:  11nM. Assay description: In vitro inhibitory activity against enkephalinase enzyme from rat.
In DepthDetails ArticlePubMed