BDBM50008665 4-Dipentylcarbamoyl-4-[(naphthalene-1-carbonyl)-amino]-butyric acid::CHEMBL112215
SMILES CCCCCN(CCCCC)C(=O)[C@@H](CCC(O)=O)NC(=O)c1cccc2ccccc12
InChI Key InChIKey=YPCMAANEQQZGBR-HSZRJFAPSA-N
Data  3 IC50
  Tab Delimited (TSV)   2D SDfile   Computed 3D by Vconf -m prep SDfile
Find this compound or compounds like it in BindingDB:
Activity Spreadsheet -- Enzyme Inhibition Constant Data from BindingDB
Found 3 hits for monomerid = 50008665
TargetCholecystokinin receptor type A(Cavia porcellus)
Abbott Laboratories
Curated by ChEMBL
LigandPNGBDBM50008665(4-Dipentylcarbamoyl-4-[(naphthalene-1-carbonyl)-am...)
Affinity DataIC50:  320nM. Assay description: Inhibition of [125I]-Bolton-Hunter CCK-8 binding to cholecystokinin type A receptor in guinea pig pancreatic membranes.
In DepthDetails ArticlePubMed
TargetCholecystokinin receptor type A(Cavia porcellus)
Abbott Laboratories
Curated by ChEMBL
LigandPNGBDBM50008665(4-Dipentylcarbamoyl-4-[(naphthalene-1-carbonyl)-am...)
Affinity DataIC50:  1.10E+4nM. Assay description: Compound was evaluated for the binding affinity against CCK A receptor in cortical cells.
In DepthDetails ArticlePubMed
TargetCholecystokinin receptor type A(Cavia porcellus)
Abbott Laboratories
Curated by ChEMBL
LigandPNGBDBM50008665(4-Dipentylcarbamoyl-4-[(naphthalene-1-carbonyl)-am...)
Affinity DataIC50:  320nM. Assay description: Compound was evaluated for the binding affinity against Cholecystokinin type A receptor in pancreatic acinar cell
In DepthDetails ArticlePubMed