BDBM50008795 7-(3-Pyridin-3-yl-bicyclo[2.2.1]hept-2-yl)-heptanoic acid::CHEMBL299878
SMILES OC(=O)CCCCCC[C@@H]1C2CCC(C2)C1c1cccnc1
InChI Key InChIKey=SMSRXWFVIGHRDT-IDWHDZOISA-N
Data  1 IC50
  Tab Delimited (TSV)   2D SDfile   Computed 3D by Vconf -m prep SDfile
Find this compound or compounds like it in BindingDB:
Activity Spreadsheet -- Enzyme Inhibition Constant Data from BindingDB
Found 1 hit for monomerid = 50008795
TargetThromboxane-A synthase(Homo sapiens (Human))
Ciba-Geigy
Curated by ChEMBL
LigandPNGBDBM50008795(7-(3-Pyridin-3-yl-bicyclo[2.2.1]hept-2-yl)-heptano...)
Affinity DataIC50:  125nM. Assay description: In vitro inhibition of thromboxane synthase using [14C]-arachidonic acid
In DepthDetails ArticlePubMed